Reaction Details
TargetCathepsin B
LigandBDBM50377601
Substrate/Competitorn/a
Meas. Tech.ChEMBL_479741 (CHEMBL929238)
IC50 300±n/a nM
Citation Mallari, JPShelat, AKosinski, ACaffrey, CRConnelly, MZhu, FMcKerrow, JHGuy, RK Discovery of trypanocidal thiosemicarbazone inhibitors of rhodesain and TbcatB. Bioorg Med Chem Lett18:2883-5 (2008) 
 
Cathepsin B
Name:Cathepsin B
Type:Enzyme
Mol. Mass.:37819.69
Organism:Homo sapiens (Human)
Description:gi_63102437
Residue:339
BDBM50377601
NameBDBM50377601
Synonyms:CHEMBL259379
TypeSmall organic molecule
Emp. Form.C12H9Cl2N3S2
Mol. Mass.330.256
SMILESNC(=S)NN=C(c1cccs1)c1cc(Cl)cc(Cl)c1