Reaction Details
TargetVascular endothelial growth factor receptor 2
LigandBDBM50132151
Substrate/Competitorn/a
Meas. Tech.ChEMBL_479743 (CHEMBL929240)
IC50 20±n/a nM
Citation Honda, TTajima, HKaneko, YBan, MInaba, TTakeno, YOkamoto, KAono, H Conformation-activity relationship on novel 4-pyridylmethylthio derivatives with antiangiogenic activity. Bioorg Med Chem Lett18:2939-43 (2008) 
 
Vascular endothelial growth factor receptor 2
Name:Vascular endothelial growth factor receptor 2
Type:Receptor Tyrosine Kinase
Mol. Mass.:151510.97
Organism:Homo sapiens (Human)
Description:P35968
Residue:1356
BDBM50132151
NameBDBM50132151
Synonyms:CHEMBL101683 N-(4-chlorophenyl)-2-(pyridin-4-ylmethylamino)benzamide | N-(4-chlorophenyl)-2-[(pyridin-4-ylmethyl)amino]benzamide
TypeSmall organic molecule
Emp. Form.C19H16ClN3O
Mol. Mass.337.803
SMILESClc1ccc(NC(=O)c2ccccc2NCc2ccncc2)cc1