Reaction Details
TargetProthrombin
LigandBDBM50377608
Substrate/Competitorn/a
Meas. Tech.ChEMBL_479759 (CHEMBL934691)
Ki 4±n/a nM
Citation Kreutter, KDLu, TLee, LGiardino, ECPatel, SHuang, HXu, GFitzgerald, MHaertlein, BJMohan, VCrysler, CEisennagel, SDasgupta, MMcMillan, MSpurlino, JCHuebert, NDMaryanoff, BETomczuk, BEDamiano, BPPlayer, MR Orally efficacious thrombin inhibitors with cyanofluorophenylacetamide as the P2 motif. Bioorg Med Chem Lett18:2865-70 (2008) 
 
Prothrombin
Name:Prothrombin
Type:Protein
Mol. Mass.:70029.57
Organism:Homo sapiens (Human)
Description:P00734
Residue:622
BDBM50377608
NameBDBM50377608
Synonyms:CHEMBL256941
TypeSmall organic molecule
Emp. Form.C18H24N6O5S
Mol. Mass.436.485
SMILES[#6]-c1cccc(c1)S(=O)(=O)[#7]-c1ccc(-[#6])n(-[#6]-[#6](=O)-[#7]-[#6]-[#6]-[#8]\[#7]=[#6](\[#7])-[#7])c1=O