Reaction Details
TargetProthrombin
LigandBDBM50377610
Substrate/Competitorn/a
Meas. Tech.ChEMBL_479759 (CHEMBL934691)
Ki 33±n/a nM
Citation Kreutter, KDLu, TLee, LGiardino, ECPatel, SHuang, HXu, GFitzgerald, MHaertlein, BJMohan, VCrysler, CEisennagel, SDasgupta, MMcMillan, MSpurlino, JCHuebert, NDMaryanoff, BETomczuk, BEDamiano, BPPlayer, MR Orally efficacious thrombin inhibitors with cyanofluorophenylacetamide as the P2 motif. Bioorg Med Chem Lett18:2865-70 (2008) 
 
Prothrombin
Name:Prothrombin
Type:Protein
Mol. Mass.:70029.57
Organism:Homo sapiens (Human)
Description:P00734
Residue:622
BDBM50377610
NameBDBM50377610
Synonyms:CHEMBL250551
TypeSmall organic molecule
Emp. Form.C22H17F4N5O
Mol. Mass.443.3969
SMILESFc1cccnc1CNC(=O)Cc1c(F)c(NCC(F)(F)c2ccccn2)ccc1C#N