Reaction Details
TargetCoagulation factor X
LigandBDBM50328717
Substrate/Competitorn/a
Meas. Tech.ChEMBL_479811 (CHEMBL930381)
Ki 0.057±n/a nM
Citation Corte, JRFang, TPinto, DJHan, WHu, ZJiang, XJLi, YLGauuan, JFHadden, MOrton, DRendina, ARLuettgen, JMWong, PCHe, KMorin, PEChang, CHCheney, DLKnabb, RMWexler, RRLam, PY Structure-activity relationships of anthranilamide-based factor Xa inhibitors containing piperidinone and pyridinone P4 moieties. Bioorg Med Chem Lett18:2845-9 (2008) 
 
Coagulation factor X
Name:Coagulation factor X
Type:Enzyme
Mol. Mass.:54726.60
Organism:Homo sapiens (Human)
Description:n/a
Residue:488
BDBM50328717
NameBDBM50328717
Synonyms:5-Chloro-N-(5-chloro-pyridin-2-yl)-3-methoxy-2-[4-(2-oxo-piperidin-1-yl)-benzoylamino]-benzamide CHEMBL260085
TypeSmall organic molecule
Emp. Form.C25H22Cl2N4O4
Mol. Mass.513.373
SMILESCOc1cc(Cl)cc(C(=O)Nc2ccc(Cl)cn2)c1NC(=O)c1ccc(cc1)N1CCCCC1=O