Reaction Details
TargetCoagulation factor X
LigandBDBM50377633
Substrate/Competitorn/a
Meas. Tech.ChEMBL_479811 (CHEMBL930381)
Ki 0.45±n/a nM
Citation Corte, JRFang, TPinto, DJHan, WHu, ZJiang, XJLi, YLGauuan, JFHadden, MOrton, DRendina, ARLuettgen, JMWong, PCHe, KMorin, PEChang, CHCheney, DLKnabb, RMWexler, RRLam, PY Structure-activity relationships of anthranilamide-based factor Xa inhibitors containing piperidinone and pyridinone P4 moieties. Bioorg Med Chem Lett18:2845-9 (2008) 
 
Coagulation factor X
Name:Coagulation factor X
Type:Enzyme
Mol. Mass.:54726.60
Organism:Homo sapiens (Human)
Description:n/a
Residue:488
BDBM50377633
NameBDBM50377633
Synonyms:CHEMBL403075
TypeSmall organic molecule
Emp. Form.C25H20ClN5O3
Mol. Mass.473.911
SMILESClc1ccc(NC(=O)c2cc(ccc2NC(=O)c2ccc(cc2)N2CCCCC2=O)C#N)nc1