Reaction Details
TargetCoagulation factor X
LigandBDBM50377637
Substrate/Competitorn/a
Meas. Tech.ChEMBL_479811 (CHEMBL930381)
Ki 0.028±n/a nM
Citation Corte, JRFang, TPinto, DJHan, WHu, ZJiang, XJLi, YLGauuan, JFHadden, MOrton, DRendina, ARLuettgen, JMWong, PCHe, KMorin, PEChang, CHCheney, DLKnabb, RMWexler, RRLam, PY Structure-activity relationships of anthranilamide-based factor Xa inhibitors containing piperidinone and pyridinone P4 moieties. Bioorg Med Chem Lett18:2845-9 (2008) 
 
Coagulation factor X
Name:Coagulation factor X
Type:Enzyme
Mol. Mass.:54726.60
Organism:Homo sapiens (Human)
Description:n/a
Residue:488
BDBM50377637
NameBDBM50377637
Synonyms:CHEMBL257398
TypeSmall organic molecule
Emp. Form.C25H19ClN4O3
Mol. Mass.458.896
SMILESCc1ccc(NC(=O)c2ccc(cc2)-n2ccccc2=O)c(c1)C(=O)Nc1ccc(Cl)cn1