Reaction Details
TargetCoagulation factor X
LigandBDBM50377640
Substrate/Competitorn/a
Meas. Tech.ChEMBL_479811 (CHEMBL930381)
Ki 0.12±n/a nM
Citation Corte, JRFang, TPinto, DJHan, WHu, ZJiang, XJLi, YLGauuan, JFHadden, MOrton, DRendina, ARLuettgen, JMWong, PCHe, KMorin, PEChang, CHCheney, DLKnabb, RMWexler, RRLam, PY Structure-activity relationships of anthranilamide-based factor Xa inhibitors containing piperidinone and pyridinone P4 moieties. Bioorg Med Chem Lett18:2845-9 (2008) 
 
Coagulation factor X
Name:Coagulation factor X
Type:Enzyme
Mol. Mass.:54726.60
Organism:Homo sapiens (Human)
Description:n/a
Residue:488
BDBM50377640
NameBDBM50377640
Synonyms:CHEMBL258196
TypeSmall organic molecule
Emp. Form.C25H20ClN5O5S
Mol. Mass.537.975
SMILESCS(=O)(=O)Nc1ccc(NC(=O)c2ccc(cc2)-n2ccccc2=O)c(c1)C(=O)Nc1ccc(Cl)cn1