Reaction Details
TargetCoagulation factor X
LigandBDBM50377641
Substrate/Competitorn/a
Meas. Tech.ChEMBL_479811 (CHEMBL930381)
Ki 0.62±n/a nM
Citation Corte, JRFang, TPinto, DJHan, WHu, ZJiang, XJLi, YLGauuan, JFHadden, MOrton, DRendina, ARLuettgen, JMWong, PCHe, KMorin, PEChang, CHCheney, DLKnabb, RMWexler, RRLam, PY Structure-activity relationships of anthranilamide-based factor Xa inhibitors containing piperidinone and pyridinone P4 moieties. Bioorg Med Chem Lett18:2845-9 (2008) 
 
Coagulation factor X
Name:Coagulation factor X
Type:Enzyme
Mol. Mass.:54726.60
Organism:Homo sapiens (Human)
Description:n/a
Residue:488
BDBM50377641
NameBDBM50377641
Synonyms:CHEMBL402836
TypeSmall organic molecule
Emp. Form.C24H19ClN4O2
Mol. Mass.430.886
SMILESClc1ccc(NCc2ccccc2NC(=O)c2ccc(cc2)-n2ccccc2=O)nc1