Reaction Details
TargetFatty-acid amide hydrolase 1 [30-579]
LigandBDBM50377658
Substrate/Competitorn/a
Meas. Tech.ChEMBL_479892 (CHEMBL935745)
IC50>50000±n/a nM
Citation Ortar, GSchiano Moriello, ACascio, MGDe Petrocellis, LLigresti, AMorera, ENalli, MDi Marzo, V New tetrazole-based selective anandamide uptake inhibitors. Bioorg Med Chem Lett18:2820-4 (2008) 
 
Fatty-acid amide hydrolase 1 [30-579]
Name:Fatty-acid amide hydrolase 1 [30-579]
Type:Single-pass membrane protein; homodimer
Mol. Mass.:60474.00
Organism:Rattus norvegicus (rat)
Description:P97612 (aa 30-579)
Residue:550
BDBM50377658
NameBDBM50377658
Synonyms:CHEMBL257157
TypeSmall organic molecule
Emp. Form.C16H13N5
Mol. Mass.275.3079
SMILESN#CCn1nnc(Cc2ccc(cc2)-c2ccccc2)n1