Reaction Details
TargetDiacylglycerol lipase-alpha
LigandBDBM50377668
Substrate/Competitorn/a
Meas. Tech.ChEMBL_479895 (CHEMBL935748)
IC50>10000±n/a nM
Citation Ortar, GSchiano Moriello, ACascio, MGDe Petrocellis, LLigresti, AMorera, ENalli, MDi Marzo, V New tetrazole-based selective anandamide uptake inhibitors. Bioorg Med Chem Lett18:2820-4 (2008) 
 
Diacylglycerol lipase-alpha
Name:Diacylglycerol lipase-alpha
Type:PROTEIN
Mol. Mass.:114947.74
Organism:Homo sapiens (Human)
Description:ChEMBL_1449471
Residue:1042
BDBM50377668
NameBDBM50377668
Synonyms:CHEMBL258162
TypeSmall organic molecule
Emp. Form.C19H20N6O2
Mol. Mass.364.4011
SMILESCN(C)C(=O)Cn1nnc(CNC(=O)c2ccc(cc2)-c2ccccc2)n1