Reaction Details
TargetDiacylglycerol lipase-alpha
LigandBDBM50377659
Substrate/Competitorn/a
Meas. Tech.ChEMBL_479895 (CHEMBL935748)
IC50>10000±n/a nM
Citation Ortar, GSchiano Moriello, ACascio, MGDe Petrocellis, LLigresti, AMorera, ENalli, MDi Marzo, V New tetrazole-based selective anandamide uptake inhibitors. Bioorg Med Chem Lett18:2820-4 (2008) 
 
Diacylglycerol lipase-alpha
Name:Diacylglycerol lipase-alpha
Type:PROTEIN
Mol. Mass.:114947.74
Organism:Homo sapiens (Human)
Description:ChEMBL_1449471
Residue:1042
BDBM50377659
NameBDBM50377659
Synonyms:CHEMBL404652
TypeSmall organic molecule
Emp. Form.C16H13N5
Mol. Mass.275.3079
SMILESN#CCn1nnnc1Cc1ccc(cc1)-c1ccccc1