Reaction Details
TargetCannabinoid receptor 1
LigandBDBM50377668
Substrate/Competitorn/a
Meas. Tech.ChEMBL_479896 (CHEMBL935749)
Ki>10000±n/a nM
Citation Ortar, GSchiano Moriello, ACascio, MGDe Petrocellis, LLigresti, AMorera, ENalli, MDi Marzo, V New tetrazole-based selective anandamide uptake inhibitors. Bioorg Med Chem Lett18:2820-4 (2008) 
 
Cannabinoid receptor 1
Name:Cannabinoid receptor 1
Type:G Protein-Coupled Receptor (GPCR)
Mol. Mass.:52868.96
Organism:Homo sapiens (Human)
Description:P21554
Residue:472
BDBM50377668
NameBDBM50377668
Synonyms:CHEMBL258162
TypeSmall organic molecule
Emp. Form.C19H20N6O2
Mol. Mass.364.4011
SMILESCN(C)C(=O)Cn1nnc(CNC(=O)c2ccc(cc2)-c2ccccc2)n1