Reaction Details
TargetCannabinoid receptor 1
LigandBDBM50377672
Substrate/Competitorn/a
Meas. Tech.ChEMBL_479896 (CHEMBL935749)
Ki>10000±n/a nM
Citation Ortar, GSchiano Moriello, ACascio, MGDe Petrocellis, LLigresti, AMorera, ENalli, MDi Marzo, V New tetrazole-based selective anandamide uptake inhibitors. Bioorg Med Chem Lett18:2820-4 (2008) 
 
Cannabinoid receptor 1
Name:Cannabinoid receptor 1
Type:G Protein-Coupled Receptor (GPCR)
Mol. Mass.:52868.96
Organism:Homo sapiens (Human)
Description:P21554
Residue:472
BDBM50377672
NameBDBM50377672
Synonyms:CHEMBL255903
TypeSmall organic molecule
Emp. Form.C18H20N4
Mol. Mass.292.3782
SMILESCC(C)Cn1nnnc1Cc1ccc(cc1)-c1ccccc1