Reaction Details
TargetCannabinoid receptor 1
LigandBDBM50377673
Substrate/Competitorn/a
Meas. Tech.ChEMBL_479896 (CHEMBL935749)
Ki>10000±n/a nM
Citation Ortar, GSchiano Moriello, ACascio, MGDe Petrocellis, LLigresti, AMorera, ENalli, MDi Marzo, V New tetrazole-based selective anandamide uptake inhibitors. Bioorg Med Chem Lett18:2820-4 (2008) 
 
Cannabinoid receptor 1
Name:Cannabinoid receptor 1
Type:G Protein-Coupled Receptor (GPCR)
Mol. Mass.:52868.96
Organism:Homo sapiens (Human)
Description:P21554
Residue:472
BDBM50377673
NameBDBM50377673
Synonyms:CHEMBL257961
TypeSmall organic molecule
Emp. Form.C18H17N5O3
Mol. Mass.351.3593
SMILESCOC(=O)Cn1nnc(CNC(=O)c2ccc(cc2)-c2ccccc2)n1