Reaction Details
TargetTransient receptor potential cation channel subfamily V member 1
LigandBDBM50377665
Substrate/Competitorn/a
Meas. Tech.ChEMBL_479900 (CHEMBL935753)
EC50 53500±n/a nM
Citation Ortar, GSchiano Moriello, ACascio, MGDe Petrocellis, LLigresti, AMorera, ENalli, MDi Marzo, V New tetrazole-based selective anandamide uptake inhibitors. Bioorg Med Chem Lett18:2820-4 (2008) 
 
Transient receptor potential cation channel subfamily V member 1
Name:Transient receptor potential cation channel subfamily V member 1
Type:Protein
Mol. Mass.:94960.75
Organism:Homo sapiens (Human)
Description:Q8NER1
Residue:839
BDBM50377665
NameBDBM50377665
Synonyms:CHEMBL257777
TypeSmall organic molecule
Emp. Form.C19H21N5O
Mol. Mass.335.4029
SMILESCC(C)Cn1nnc(CNC(=O)c2ccc(cc2)-c2ccccc2)n1