Reaction Details
TargetCannabinoid receptor 2
LigandBDBM50377658
Substrate/Competitorn/a
Meas. Tech.ChEMBL_479897 (CHEMBL935750)
Ki 6200±n/a nM
Citation Ortar, GSchiano Moriello, ACascio, MGDe Petrocellis, LLigresti, AMorera, ENalli, MDi Marzo, V New tetrazole-based selective anandamide uptake inhibitors. Bioorg Med Chem Lett18:2820-4 (2008) 
 
Cannabinoid receptor 2
Name:Cannabinoid receptor 2
Type:G Protein-Coupled Receptor (GPCR)
Mol. Mass.:39690.94
Organism:Homo sapiens (Human)
Description:P34972
Residue:360
BDBM50377658
NameBDBM50377658
Synonyms:CHEMBL257157
TypeSmall organic molecule
Emp. Form.C16H13N5
Mol. Mass.275.3079
SMILESN#CCn1nnc(Cc2ccc(cc2)-c2ccccc2)n1