Reaction Details
TargetTransient receptor potential cation channel subfamily A member 1
LigandBDBM50377660
Substrate/Competitorn/a
Meas. Tech.ChEMBL_479898 (CHEMBL935751)
EC50 26300±n/a nM
Citation Ortar, GSchiano Moriello, ACascio, MGDe Petrocellis, LLigresti, AMorera, ENalli, MDi Marzo, V New tetrazole-based selective anandamide uptake inhibitors. Bioorg Med Chem Lett18:2820-4 (2008) 
 
Transient receptor potential cation channel subfamily A member 1
Name:Transient receptor potential cation channel subfamily A member 1
Type:PROTEIN
Mol. Mass.:128622.74
Organism:Rattus norvegicus
Description:ChEMBL_1450487
Residue:1125
BDBM50377660
NameBDBM50377660
Synonyms:CHEMBL255904
TypeSmall organic molecule
Emp. Form.C18H20N4
Mol. Mass.292.3782
SMILESCC(C)Cn1nnc(Cc2ccc(cc2)-c2ccccc2)n1