Reaction Details
TargetTransient receptor potential cation channel subfamily A member 1
LigandBDBM50377670
Substrate/Competitorn/a
Meas. Tech.ChEMBL_479898 (CHEMBL935751)
EC50>100000±n/a nM
Citation Ortar, GSchiano Moriello, ACascio, MGDe Petrocellis, LLigresti, AMorera, ENalli, MDi Marzo, V New tetrazole-based selective anandamide uptake inhibitors. Bioorg Med Chem Lett18:2820-4 (2008) 
 
Transient receptor potential cation channel subfamily A member 1
Name:Transient receptor potential cation channel subfamily A member 1
Type:PROTEIN
Mol. Mass.:128622.74
Organism:Rattus norvegicus
Description:ChEMBL_1450487
Residue:1125
BDBM50377670
NameBDBM50377670
Synonyms:CHEMBL254788
TypeSmall organic molecule
Emp. Form.C18H19N5O
Mol. Mass.321.3764
SMILESCN(C)C(=O)Cn1nnc(Cc2ccc(cc2)-c2ccccc2)n1