Reaction Details
TargetAdenosine receptor A3
LigandBDBM50163012
Substrate/Competitorn/a
Meas. Tech.ChEMBL_479904 (CHEMBL935757)
Ki 1.2±n/a nM
Citation Melman, AGao, ZGKumar, DWan, TCGizewski, EAuchampach, JAJacobson, KA Design of (N)-methanocarba adenosine 5'-uronamides as species-independent A3 receptor-selective agonists. Bioorg Med Chem Lett18:2813-9 (2008) 
 
Adenosine receptor A3
Name:Adenosine receptor A3
Type:PROTEIN
Mol. Mass.:36460.91
Organism:Mus musculus
Description:ChEMBL_1515686
Residue:319
BDBM50163012
NameBDBM50163012
Synonyms:(1S,2R,3S,4R,5S)-4-(6-(3-chlorobenzylamino)-2-iodo-9H-purin-9-yl)-2,3-dihydroxy-N-methylbicyclo[3.1.0]hexane-1-carboxamide CHEMBL175444
TypeSmall organic molecule
Emp. Form.C20H20ClIN6O3
Mol. Mass.554.769
SMILESCNC(=O)[C@]12C[C@@H]1[C@H]([C@H](O)[C@@H]2O)n1cnc2c(NCc3cccc(Cl)c3)nc(I)nc12