Reaction Details
TargetHistone deacetylase 6
LigandBDBM50377688
Substrate/Competitorn/a
Meas. Tech.ChEMBL_479926 (CHEMBL929249)
Ki 6.6±n/a nM
Citation Mazitschek, RPatel, VWirth, DFClardy, J Development of a fluorescence polarization based assay for histone deacetylase ligand discovery. Bioorg Med Chem Lett18:2809-12 (2008) 
 
Histone deacetylase 6
Name:Histone deacetylase 6
Type:Chromatin regulator; hydrolase; repressor
Mol. Mass.:131381.51
Organism:Homo sapiens (Human)
Description:Q9UBN7
Residue:1215
BDBM50377688
NameBDBM50377688
Synonyms:CHEMBL260653
TypeSmall organic molecule
Emp. Form.C20H31N7O3
Mol. Mass.417.5052
SMILESNCCCn1cc(CNc2ccc(cc2)C(=O)NCCCCCCC(=O)NO)nn1