Reaction Details
TargetHistone deacetylase 3/Nuclear receptor corepressor 2 (HDAC3/NCoR2)
LigandBDBM29590
Substrate/Competitorn/a
Meas. Tech.ChEMBL_479925 (CHEMBL929248)
Ki>75000±n/a nM
Citation Mazitschek, RPatel, VWirth, DFClardy, J Development of a fluorescence polarization based assay for histone deacetylase ligand discovery. Bioorg Med Chem Lett18:2809-12 (2008) 
 
Histone deacetylase 3/Nuclear receptor corepressor 2 (HDAC3/NCoR2)
Name:Histone deacetylase 3/Nuclear receptor corepressor 2 (HDAC3/NCoR2)
Type:n/a
Mol. Mass.:n/a
Description:ASSAY_ID of ChEMBL is 2146499
Components:This complex has 2 components.
Component 1
Name:Histone deacetylase 3
Synonyms:HD3 HDAC3_HUMAN Human HDAC3 SMAP45
Type:Enzyme
Mol. Mass.:48829.55
Organism:Homo sapiens (Human)
Description:O15379
Residue:428
Component 2
Name:Nuclear receptor corepressor 2
Synonyms:CTG repeat protein 26 Histone deacetylase 2/Nuclear receptor corepressor 2 NCOR2 Nuclear receptor corepressor 2 SMAP270 Silencing mediator of retinoic acid and thyroid hormone receptor TRAC | Thyroid-, retinoic-acid-receptor-associated corepressor
Type:Enzyme
Mol. Mass.:274839.59
Organism:Homo sapiens (Human)
Description:Q9Y618
Residue:2514
BDBM29590
NameBDBM29590
Synonyms:1,2-Dihydro-3H-naphtho[2,1-b]pyran-3-one splitomicin
TypeSmall organic molecule
Emp. Form.C13H10O2
Mol. Mass.198.2173
SMILESO=C1CCc2c(O1)ccc1ccccc21