Reaction Details
TargetCannabinoid receptor 2
LigandBDBM50377691
Substrate/Competitorn/a
Meas. Tech.ChEMBL_479928 (CHEMBL929251)
Ki 430±n/a nM
Citation Worm, KZhou, QJSaeui, CTGreen, RCCassel, JAStabley, GJDeHaven, RNConway-James, NLaBuda, CJKoblish, MLittle, PJDolle, RE Sulfamoyl benzamides as novel CB2 cannabinoid receptor ligands. Bioorg Med Chem Lett18:2830-5 (2008) 
 
Cannabinoid receptor 2
Name:Cannabinoid receptor 2
Type:G Protein-Coupled Receptor (GPCR)
Mol. Mass.:39690.94
Organism:Homo sapiens (Human)
Description:P34972
Residue:360
BDBM50377691
NameBDBM50377691
Synonyms:CHEMBL255923
TypeSmall organic molecule
Emp. Form.C20H25BrN2O3S
Mol. Mass.453.393
SMILESCN(Cc1ccccc1)S(=O)(=O)c1cc(ccc1Br)C(=O)NCC(C)(C)C