Reaction Details
TargetCannabinoid receptor 2
LigandBDBM50377700
Substrate/Competitorn/a
Meas. Tech.ChEMBL_479928 (CHEMBL929251)
Ki 92±n/a nM
Citation Worm, KZhou, QJSaeui, CTGreen, RCCassel, JAStabley, GJDeHaven, RNConway-James, NLaBuda, CJKoblish, MLittle, PJDolle, RE Sulfamoyl benzamides as novel CB2 cannabinoid receptor ligands. Bioorg Med Chem Lett18:2830-5 (2008) 
 
Cannabinoid receptor 2
Name:Cannabinoid receptor 2
Type:G Protein-Coupled Receptor (GPCR)
Mol. Mass.:39690.94
Organism:Homo sapiens (Human)
Description:P34972
Residue:360
BDBM50377700
NameBDBM50377700
Synonyms:CHEMBL255681
TypeSmall organic molecule
Emp. Form.C20H30N2O4S
Mol. Mass.394.528
SMILESCC1CCCC(C)C1NC(=O)c1ccc(C)c(c1)S(=O)(=O)N1CCOCC1