Reaction Details
TargetCannabinoid receptor 2
LigandBDBM50377702
Substrate/Competitorn/a
Meas. Tech.ChEMBL_479928 (CHEMBL929251)
Ki 19±n/a nM
Citation Worm, KZhou, QJSaeui, CTGreen, RCCassel, JAStabley, GJDeHaven, RNConway-James, NLaBuda, CJKoblish, MLittle, PJDolle, RE Sulfamoyl benzamides as novel CB2 cannabinoid receptor ligands. Bioorg Med Chem Lett18:2830-5 (2008) 
 
Cannabinoid receptor 2
Name:Cannabinoid receptor 2
Type:G Protein-Coupled Receptor (GPCR)
Mol. Mass.:39690.94
Organism:Homo sapiens (Human)
Description:P34972
Residue:360
BDBM50377702
NameBDBM50377702
Synonyms:CHEMBL258244
TypeSmall organic molecule
Emp. Form.C22H30N2O4S
Mol. Mass.418.55
SMILESCc1ccc(cc1S(=O)(=O)N1CCOCC1)C(=O)NC12CC3CC(CC(C3)C1)C2