Reaction Details
TargetCannabinoid receptor 2
LigandBDBM50377709
Substrate/Competitorn/a
Meas. Tech.ChEMBL_479928 (CHEMBL929251)
Ki 11±n/a nM
Citation Worm, KZhou, QJSaeui, CTGreen, RCCassel, JAStabley, GJDeHaven, RNConway-James, NLaBuda, CJKoblish, MLittle, PJDolle, RE Sulfamoyl benzamides as novel CB2 cannabinoid receptor ligands. Bioorg Med Chem Lett18:2830-5 (2008) 
 
Cannabinoid receptor 2
Name:Cannabinoid receptor 2
Type:G Protein-Coupled Receptor (GPCR)
Mol. Mass.:39690.94
Organism:Homo sapiens (Human)
Description:P34972
Residue:360
BDBM50377709
NameBDBM50377709
Synonyms:CHEMBL256754
TypeSmall organic molecule
Emp. Form.C25H31BrN2O3S
Mol. Mass.519.494
SMILESCN(Cc1ccccc1)S(=O)(=O)c1cc(ccc1Br)C(=O)N[C@@H]1C(C)(C)[C@H]2CC[C@]1(C)C2