Reaction Details
TargetCannabinoid receptor 1
LigandBDBM50377698
Substrate/Competitorn/a
Meas. Tech.ChEMBL_479931 (CHEMBL929254)
EC50>1000±n/a nM
Citation Worm, KZhou, QJSaeui, CTGreen, RCCassel, JAStabley, GJDeHaven, RNConway-James, NLaBuda, CJKoblish, MLittle, PJDolle, RE Sulfamoyl benzamides as novel CB2 cannabinoid receptor ligands. Bioorg Med Chem Lett18:2830-5 (2008) 
 
Cannabinoid receptor 1
Name:Cannabinoid receptor 1
Type:G Protein-Coupled Receptor (GPCR)
Mol. Mass.:52868.96
Organism:Homo sapiens (Human)
Description:P21554
Residue:472
BDBM50377698
NameBDBM50377698
Synonyms:CHEMBL429851
TypeSmall organic molecule
Emp. Form.C17H26N2O4S
Mol. Mass.354.464
SMILESCc1ccc(cc1S(=O)(=O)N1CCOCC1)C(=O)NCC(C)(C)C