Reaction Details
TargetCannabinoid receptor 1
LigandBDBM50239215
Substrate/Competitorn/a
Meas. Tech.ChEMBL_479931 (CHEMBL929254)
EC50 920±n/a nM
Citation Worm, KZhou, QJSaeui, CTGreen, RCCassel, JAStabley, GJDeHaven, RNConway-James, NLaBuda, CJKoblish, MLittle, PJDolle, RE Sulfamoyl benzamides as novel CB2 cannabinoid receptor ligands. Bioorg Med Chem Lett18:2830-5 (2008) 
 
Cannabinoid receptor 1
Name:Cannabinoid receptor 1
Type:G Protein-Coupled Receptor (GPCR)
Mol. Mass.:52868.96
Organism:Homo sapiens (Human)
Description:P21554
Residue:472
BDBM50239215
NameBDBM50239215
Synonyms:4-methyl-3-(morpholinosulfonyl)-N-(2,2,4,4-tetramethylpentan-3-yl)benzamide | CHEMBL258242
TypeSmall organic molecule
Emp. Form.C21H34N2O4S
Mol. Mass.410.571
SMILESCc1ccc(cc1S(=O)(=O)N1CCOCC1)C(=O)NC(C(C)(C)C)C(C)(C)C