Reaction Details
TargetRAF proto-oncogene serine/threonine-protein kinase
LigandBDBM50377760
Substrate/Competitorn/a
Meas. Tech.ChEMBL_480033 (CHEMBL927975)
IC50 31±n/a nM
Citation Wolin, RLBembenek, SDWei, JCrawford, SLundeen, KBrunmark, AKarlsson, LEdwards, JPBlevitt, JM Dual binding site inhibitors of B-RAF kinase. Bioorg Med Chem Lett18:2825-9 (2008) 
 
RAF proto-oncogene serine/threonine-protein kinase
Name:RAF proto-oncogene serine/threonine-protein kinase
Type:Serine/threonine-protein kinase
Mol. Mass.:73082.52
Organism:Homo sapiens (Human)
Description:P04049
Residue:648
BDBM50377760
NameBDBM50377760
Synonyms:CHEMBL255496
TypeSmall organic molecule
Emp. Form.C31H24ClF3N8O2
Mol. Mass.633.023
SMILESNC(=O)c1cccc(Nc2nccc(n2)-c2nc([nH]c2-c2cccc(NC(=O)Nc3ccc(Cl)c(c3)C(F)(F)F)c2)C2CC2)c1