Reaction Details
TargetSerine/threonine-protein kinase B-raf
LigandBDBM50377766
Substrate/Competitorn/a
Meas. Tech.ChEMBL_480031 (CHEMBL927972)
IC50 9±n/a nM
Citation Wolin, RLBembenek, SDWei, JCrawford, SLundeen, KBrunmark, AKarlsson, LEdwards, JPBlevitt, JM Dual binding site inhibitors of B-RAF kinase. Bioorg Med Chem Lett18:2825-9 (2008) 
 
Serine/threonine-protein kinase B-raf
Name:Serine/threonine-protein kinase B-raf
Type:Serine/threonine-protein kinase
Mol. Mass.:84446.00
Organism:Homo sapiens (Human)
Description:P15056
Residue:766
BDBM50377766
NameBDBM50377766
Synonyms:CHEMBL403854
TypeSmall organic molecule
Emp. Form.C25H23ClN6O
Mol. Mass.458.943
SMILESCNc1nccc(n1)-c1nc([nH]c1-c1cccc(NC(=O)Cc2ccc(Cl)cc2)c1)C1CC1