Reaction Details
Target11-beta-hydroxysteroid dehydrogenase 1
LigandBDBM50377883
Substrate/Competitorn/a
Meas. Tech.ChEMBL_480088 (CHEMBL934813)
IC50 1±n/a nM
Citation Zhu, YOlson, SHGraham, DPatel, GHermanowski-Vosatka, AMundt, SShah, KSpringer, MThieringer, RWright, SXiao, JZokian, HDragovic, JBalkovec, JM Phenylcyclobutyl triazoles as selective inhibitors of 11beta-hydroxysteroid dehydrogenase type I. Bioorg Med Chem Lett18:3412-6 (2008) 
 
11-beta-hydroxysteroid dehydrogenase 1
Name:11-beta-hydroxysteroid dehydrogenase 1
Type:Enzyme
Mol. Mass.:32409.16
Organism:Homo sapiens (Human)
Description:P28845
Residue:292
BDBM50377883
NameBDBM50377883
Synonyms:CHEMBL256291
TypeSmall organic molecule
Emp. Form.C19H24FN3
Mol. Mass.313.4124
SMILESFc1ccccc1C1(CCCC1)c1nnc2CCCCCCn12