Reaction Details
TargetGonadotropin-releasing hormone receptor
LigandBDBM50377898
Substrate/Competitorn/a
Meas. Tech.ChEMBL_480124 (CHEMBL923764)
IC50 1.5±n/a nM
Citation Zhao, LGuo, ZChen, YHu, TWu, DZhu, YFRowbottom, MGross, TDTucci, FCStruthers, RSXie, QChen, C 5-Aryluracils as potent GnRH antagonists-Characterization of atropisomers. Bioorg Med Chem Lett18:3344-9 (2008) 
 
Gonadotropin-releasing hormone receptor
Name:Gonadotropin-releasing hormone receptor
Type:Enzyme
Mol. Mass.:37749.45
Organism:Homo sapiens (Human)
Description:P30968
Residue:328
BDBM50377898
NameBDBM50377898
Synonyms:CHEMBL256109
TypeSmall organic molecule
Emp. Form.C28H30ClF4N3O3
Mol. Mass.568.003
SMILESCOc1cccc(c1Cl)-c1c(C)n(Cc2c(F)cccc2C(F)(F)F)c(=O)n(C[C@H](C)NC2CCCC2)c1=O