Reaction Details
TargetProstaglandin G/H synthase 1
LigandBDBM50241453
Substrate/Competitorn/a
Meas. Tech.ChEMBL_551370 (CHEMBL1008496)
IC50 800±n/a nM
Citation Larsson, JGottfries, JBohlin, LBacklund, A Expanding the ChemGPS chemical space with natural products. J Nat Prod68:985-91 (2005) 
 
Prostaglandin G/H synthase 1
Name:Prostaglandin G/H synthase 1
Type:Enzyme
Mol. Mass.:68692.62
Organism:Homo sapiens (Human)
Description:P23219
Residue:599
BDBM50241453
NameBDBM50241453
Synonyms:1,3,6,7-tetrahydroxy-2,8-bis(3-methylbut-2-enyl)-9H-xanthen-9-one gamma-mangostin
TypeSmall organic molecule
Emp. Form.C23H24O6
Mol. Mass.396.4331
SMILES[#6]\[#6](-[#6])=[#6]\[#6]-c1c(-[#8])cc2oc3cc(-[#8])c(-[#8])c(-[#6]\[#6]=[#6](\[#6])-[#6])c3c(=O)c2c1-[#8]