Reaction Details
TargetProstaglandin G/H synthase 1
LigandBDBM20461
Substrate/Competitorn/a
Meas. Tech.ChEMBL_551370 (CHEMBL1008496)
IC50 3800±n/a nM
Citation Larsson, JGottfries, JBohlin, LBacklund, A Expanding the ChemGPS chemical space with natural products. J Nat Prod68:985-91 (2005) 
 
Prostaglandin G/H synthase 1
Name:Prostaglandin G/H synthase 1
Type:Enzyme
Mol. Mass.:68692.62
Organism:Homo sapiens (Human)
Description:P23219
Residue:599
BDBM20461
NameBDBM20461
Synonyms:(6E)-N-[(4-hydroxy-3-methoxyphenyl)methyl]-8-methylnon-6-enamide CAP Capsaicin | Zostrix
Typen/a
Emp. Form.C18H27NO3
Mol. Mass.305.4119
SMILESCOc1cc(CNC(=O)CCCC\C=C\C(C)C)ccc1O