Reaction Details
TargetDNA polymerase beta
LigandBDBM50370476
Substrate/Competitorn/a
Meas. Tech.ChEMBL_503091 (CHEMBL984068)
IC50 16000±n/a nM
Citation Pengsuparp, TSerit, MHughes, SHSoejarto, DDPezzuto, JM Specific inhibition of human immunodeficiency virus type 1 reverse transcriptase mediated by soulattrolide, a coumarin isolated from the latex of calophyllum teysmannii. J Nat Prod59:839-42 (1997) 
 
DNA polymerase beta
Name:DNA polymerase beta
Type:Protein
Mol. Mass.:38188.76
Organism:Homo sapiens (Human)
Description:n/a
Residue:335
BDBM50370476
NameBDBM50370476
Synonyms:Combivir | ZIDOVUDINE TRIPHOSPHATE
TypeSmall organic molecule
Emp. Form.C10H16N5O13P3
Mol. Mass.507.181
SMILESCc1cn([C@H]2C[C@H](N=[N+]=[N-])[C@@H](CO[P@@](O)(=O)O[P@@](O)(=O)OP(O)(O)=O)O2)c(=O)[nH]c1=O