Reaction Details
TargetDNA polymerase beta
LigandBDBM50002662
Substrate/Competitorn/a
Meas. Tech.ChEMBL_503091 (CHEMBL984068)
IC50 205000±n/a nM
Citation Pengsuparp, TSerit, MHughes, SHSoejarto, DDPezzuto, JM Specific inhibition of human immunodeficiency virus type 1 reverse transcriptase mediated by soulattrolide, a coumarin isolated from the latex of calophyllum teysmannii. J Nat Prod59:839-42 (1997) 
 
DNA polymerase beta
Name:DNA polymerase beta
Type:Protein
Mol. Mass.:38188.76
Organism:Homo sapiens (Human)
Description:n/a
Residue:335
BDBM50002662
NameBDBM50002662
Synonyms:(+)-calanolide A (10R,11S,12S)-12-Hydroxy-6,6,10,11-tetramethyl-4-propyl-11,12-dihydro-6H,10H-dipyrano[2,3-f;2',3'-h]chromen-2-one CHEMBL267447 | cid_1201
TypeSmall organic molecule
Emp. Form.C22H26O5
Mol. Mass.370.4388
SMILESCCCc1cc(=O)oc2c3[C@@H](O)[C@H](C)[C@@H](C)Oc3c3C=CC(C)(C)Oc3c12