Reaction Details
TargetRyanodine receptor 1
LigandBDBM50241985
Substrate/Competitorn/a
Meas. Tech.ChEMBL_503194 (CHEMBL990317)
EC50>100000±n/a nM
Citation Franklin, MAPenn, SGLebrilla, CBLam, THPessah, INMolinski, TF Bastadin 20 and bastadin O-sulfate esters from Ianthella basta: novel modulators of the Ry1R FKBP12 receptor complex. J Nat Prod59:1121-7 (1997) 
 
Ryanodine receptor 1
Name:Ryanodine receptor 1
Type:PROTEIN
Mol. Mass.:565099.26
Organism:Oryctolagus cuniculus
Description:ChEMBL_19634
Residue:5037
BDBM50241985
NameBDBM50241985
Synonyms:(E,Z)bastadin-19 CHEMBL506286 | CHEMBL508830
TypeSmall organic molecule
Emp. Form.C34H27Br5N4O8
Mol. Mass.1019.12
SMILESOc1c(Br)cc2CCNC(=O)C(Cc3cc(Br)c(O)c(Oc4c(Br)cc(CC(N=O)C(=O)NCCc5ccc(Oc1c2)c(Br)c5)cc4Br)c3)N=O