Reaction Details
TargetPolyunsaturated fatty acid lipoxygenase ALOX15
LigandBDBM50065997
Substrate/Competitorn/a
Meas. Tech.ChEMBL_502461 (CHEMBL986634)
IC50 580±n/a nM
Citation Amagata, TWhitman, SJohnson, TAStessman, CCLoo, CPLobkovsky, EClardy, JCrews, PHolman, TR Exploring sponge-derived terpenoids for their potency and selectivity against 12-human, 15-human, and 15-soybean lipoxygenases. J Nat Prod66:230-5 (2003) 
 
Polyunsaturated fatty acid lipoxygenase ALOX15
Name:Polyunsaturated fatty acid lipoxygenase ALOX15
Type:Protein
Mol. Mass.:74804.05
Organism:Homo sapiens (Human)
Description:n/a
Residue:662
BDBM50065997
NameBDBM50065997
Synonyms:5-[4-(3-hydroxy-4-methoxyphenyl)-2,3-dimethyl-(2R,3S)-butyl]-2-methoxyphenol dimethylnordihydroguarierate acid
TypeSmall organic molecule
Emp. Form.C20H26O4
Mol. Mass.330.418
SMILESCOc1ccc(C[C@H](C)[C@H](C)Cc2ccc(OC)c(O)c2)cc1O