Reaction Details
TargetPolyunsaturated fatty acid lipoxygenase ALOX15
LigandBDBM50269775
Substrate/Competitorn/a
Meas. Tech.ChEMBL_502461 (CHEMBL986634)
IC50>200000±n/a nM
Citation Amagata, TWhitman, SJohnson, TAStessman, CCLoo, CPLobkovsky, EClardy, JCrews, PHolman, TR Exploring sponge-derived terpenoids for their potency and selectivity against 12-human, 15-human, and 15-soybean lipoxygenases. J Nat Prod66:230-5 (2003) 
 
Polyunsaturated fatty acid lipoxygenase ALOX15
Name:Polyunsaturated fatty acid lipoxygenase ALOX15
Type:Protein
Mol. Mass.:74804.05
Organism:Homo sapiens (Human)
Description:n/a
Residue:662
BDBM50269775
NameBDBM50269775
Synonyms:CHEMBL455880 halenaquinol sulfate sodium
TypeSmall organic molecule
Emp. Form.C20H13O8S
Mol. Mass.413.378
SMILESC[C@@]12CCC(=O)c3coc(c13)C(=O)c1cc3c(O)ccc(OS([O-])(=O)=O)c3cc21