Reaction Details
TargetPolyunsaturated fatty acid lipoxygenase ALOX15
LigandBDBM50240937
Substrate/Competitorn/a
Meas. Tech.ChEMBL_502461 (CHEMBL986634)
IC50 1400±n/a nM
Citation Amagata, TWhitman, SJohnson, TAStessman, CCLoo, CPLobkovsky, EClardy, JCrews, PHolman, TR Exploring sponge-derived terpenoids for their potency and selectivity against 12-human, 15-human, and 15-soybean lipoxygenases. J Nat Prod66:230-5 (2003) 
 
Polyunsaturated fatty acid lipoxygenase ALOX15
Name:Polyunsaturated fatty acid lipoxygenase ALOX15
Type:Protein
Mol. Mass.:74804.05
Organism:Homo sapiens (Human)
Description:n/a
Residue:662
BDBM50240937
NameBDBM50240937
Synonyms:(-)-jaspic acid CHEMBL180947 | jaspic acid
TypeSmall organic molecule
Emp. Form.C27H38O3
Mol. Mass.410.5888
SMILES[#6]\[#6](-[#6])=[#6]\[#6]-[#6][C@@]1([#6])[#6]-[#6]-[#6][C@]2([#6])[#6@@H](-[#6]-c3cc(ccc3-[#8])-[#6](-[#8])=O)-[#6](-[#6])=[#6]-[#6]-[#6@@H]12