Reaction Details
TargetPolyunsaturated fatty acid lipoxygenase ALOX12
LigandBDBM50269747
Substrate/Competitorn/a
Meas. Tech.ChEMBL_502462 (CHEMBL986635)
IC50 39000±n/a nM
Citation Amagata, TWhitman, SJohnson, TAStessman, CCLoo, CPLobkovsky, EClardy, JCrews, PHolman, TR Exploring sponge-derived terpenoids for their potency and selectivity against 12-human, 15-human, and 15-soybean lipoxygenases. J Nat Prod66:230-5 (2003) 
 
Polyunsaturated fatty acid lipoxygenase ALOX12
Name:Polyunsaturated fatty acid lipoxygenase ALOX12
Type:Protein
Mol. Mass.:75689.18
Organism:Homo sapiens (Human)
Description:P18054
Residue:663
BDBM50269747
NameBDBM50269747
Synonyms:CHEMBL465615 | hyrtenone A
TypeSmall organic molecule
Emp. Form.C24H34O5
Mol. Mass.402.5238
SMILESCO[C@H]1C[C@@]2(O)[C@@H](O1)C1=C[C@H]3[C@](C)(CC[C@H]4C(C)(C)CCC[C@]34C)OC1=CC2=O