Reaction Details
TargetProstaglandin G/H synthase 1
LigandBDBM26189
Substrate/Competitorn/a
Meas. Tech.ChEMBL_481468 (CHEMBL995701)
IC50 3600±n/a nM
Citation Szewczuk, LMPenning, TM Mechanism-based inactivation of COX-1 by red wine m-hydroquinones: a structure-activity relationship study. J Nat Prod67:1777-82 (2004) 
 
Prostaglandin G/H synthase 1
Name:Prostaglandin G/H synthase 1
Type:Protein
Mol. Mass.:68868.60
Organism:Ovis aries (Sheep)
Description:n/a
Residue:600
BDBM26189
NameBDBM26189
Synonyms:α-CA inhibitor, 13 1,3-dihydroxybenzene US9688816, 4 phenol derivative, 3
TypeSmall organic molecule
Emp. Form.C6H6O2
Mol. Mass.110.1106
SMILESOc1cccc(O)c1