Reaction Details
TargetProstaglandin G/H synthase 1
LigandBDBM50236527
Substrate/Competitorn/a
Meas. Tech.ChEMBL_481473 (CHEMBL995706)
Kd 48700±n/a nM
Citation Szewczuk, LMPenning, TM Mechanism-based inactivation of COX-1 by red wine m-hydroquinones: a structure-activity relationship study. J Nat Prod67:1777-82 (2004) 
 
Prostaglandin G/H synthase 1
Name:Prostaglandin G/H synthase 1
Type:Protein
Mol. Mass.:68868.60
Organism:Ovis aries (Sheep)
Description:n/a
Residue:600
BDBM50236527
NameBDBM50236527
Synonyms:(-)-catechin (2S,3R)-2-(3,4-dihydroxyphenyl)chroman-3,5,7-triol CHEMBL200715 | Catechin
TypeSmall organic molecule
Emp. Form.C15H14O6
Mol. Mass.290.2681
SMILESO[C@@H]1Cc2c(O)cc(O)cc2O[C@H]1c1ccc(O)c(O)c1