Reaction Details
TargetProstaglandin G/H synthase 1
LigandBDBM50269597
Substrate/Competitorn/a
Meas. Tech.ChEMBL_480246 (CHEMBL1020815)
IC50 480±n/a nM
Citation Su, BNCuendet, MHawthorne, MEKardono, LBRiswan, SFong, HHMehta, RGPezzuto, JMKinghorn, AD Constituents of the bark and twigs of Artocarpus dadah with cyclooxygenase inhibitory activity. J Nat Prod65:163-9 (2002) Prostaglandin G/H synthase 1
Name:Prostaglandin G/H synthase 1
Type:Enzyme
Mol. Mass.:68692.62
Organism:Homo sapiens (Human)
Description:P23219
Residue:599
BDBM50269597
NameBDBM50269597
Synonyms:3-(2,3-dihydroxy-3-methylbutyl)resveratrol | CHEMBL446319
TypeSmall organic molecule
Emp. Form.C19H22O5
Mol. Mass.330.375
SMILESCC(C)(O)[C@H](O)Cc1cc(\C=C\c2cc(O)cc(O)c2)ccc1O