Reaction Details
TargetProstaglandin G/H synthase 2
LigandBDBM50269606
Substrate/Competitorn/a
Meas. Tech.ChEMBL_480247 (CHEMBL1020816)
IC50 15000±n/a nM
Citation Su, BNCuendet, MHawthorne, MEKardono, LBRiswan, SFong, HHMehta, RGPezzuto, JMKinghorn, AD Constituents of the bark and twigs of Artocarpus dadah with cyclooxygenase inhibitory activity. J Nat Prod65:163-9 (2002) Prostaglandin G/H synthase 2
Name:Prostaglandin G/H synthase 2
Type:Enzyme
Mol. Mass.:69003.89
Organism:Homo sapiens (Human)
Description:Recombinant Cox-2 provided by Cayman (Cayman Chemical Co.,Ann Arbor, MI).
Residue:604
BDBM50269606
NameBDBM50269606
Synonyms:CHEMBL517334 | isogemichalcone B
TypeSmall organic molecule
Emp. Form.C29H26O7
Mol. Mass.486.5125
SMILESC\C(COC(=O)\C=C\c1ccc(O)cc1)=C/Cc1c(O)ccc(C(=O)\C=C\c2ccc(O)cc2)c1O