Reaction Details
TargetAcetylcholinesterase
LigandBDBM50251187
Substrate/Competitorn/a
Meas. Tech.ChEMBL_531267 (CHEMBL986117)
Ki 130±n/a nM
Citation Wen, HLin, CQue, LGe, HMa, LCao, RWan, YPeng, WWang, ZSong, H Synthesis and biological evaluation of helicid analogues as novel acetylcholinesterase inhibitors. Eur J Med Chem43:166-73 (2008) 
 
Acetylcholinesterase
Name:Acetylcholinesterase
Type:Enzyme
Mol. Mass.:71812.79
Organism:Electrophorus electricus (Electric eel)
Description:n/a
Residue:633
BDBM50251187
NameBDBM50251187
Synonyms:1-(4-(O-beta-D-Glucopyranosyl) benzylidene) methoxyamine CHEMBL458398
TypeSmall organic molecule
Emp. Form.C14H19NO7
Mol. Mass.313.3032
SMILESCO\N=C/c1ccc(O[C@@H]2O[C@H](CO)[C@@H](O)[C@H](O)[C@H]2O)cc1