Reaction Details
TargetLysine--tRNA ligase
LigandBDBM482158
Substrate/Competitorn/a
Meas. Tech.ChEMBL_531125 (CHEMBL974011)
EC50 1474±n/a nM
Citation McDermott, USharma, SVDowell, LGreninger, PMontagut, CLamb, JArchibald, HRaudales, RTam, ALee, DRothenberg, SMSupko, JGSordella, RUlkus, LEIafrate, AJMaheswaran, SNjauw, CNTsao, HDrew, LHanke, JHMa, XJErlander, MGGray, NSHaber, DASettleman, J Identification of genotype-correlated sensitivity to selective kinase inhibitors by using high-throughput tumor cell line profiling. Proc Natl Acad Sci U S A104:19936-41 (2007) 
 
Lysine--tRNA ligase
Name:Lysine--tRNA ligase
Type:PROTEIN
Mol. Mass.:68044.78
Organism:Homo sapiens (Human)
Description:ChEMBL_960665
Residue:597
BDBM482158
NameBDBM482158
Synonyms:BDBM50242742 | TAE684
Typen/a
Emp. Form.C30H40ClN7O3S
Mol. Mass.614.202
SMILESCOc1cc(ccc1Nc1ncc(Cl)c(Nc2ccccc2S(=O)(=O)C(C)C)n1)N1CCC(CC1)N1CCN(C)CC1