Reaction Details
TargetTyrosine-protein phosphatase non-receptor type 1
LigandBDBM50104694
Substrate/Competitorn/a
Meas. Tech.ChEMBL_533185 (CHEMBL968638)
IC50 4500±n/a nM
Citation Seo, CSohn, JHPark, SMYim, JHLee, HKOh, H Usimines A-C, bioactive usnic acid derivatives from the Antarctic lichen Stereocaulon alpinum. J Nat Prod71:710-2 (2008) 
 
Tyrosine-protein phosphatase non-receptor type 1
Name:Tyrosine-protein phosphatase non-receptor type 1
Type:Protein phosphatase
Mol. Mass.:49963.76
Organism:Homo sapiens (Human)
Description:Human recombinant GST-fusion PTP1B (1-435).
Residue:435
BDBM50104694
NameBDBM50104694
Synonyms:(R)-4-hydroxy-5-(hydroxymethyl)-3-palmitoylfuran-2(5H)-one 3-Hexadecanoyl-4-hydroxy-5-hydroxymethyl-5H-furan-2-one RK-682
TypeSmall organic molecule
Emp. Form.C21H36O5
Mol. Mass.368.5075
(=O)c1c(O)oc(CO)c1O