Reaction Details
TargetSomatostatin receptor type 4
LigandBDBM50261389
Substrate/Competitorn/a
Meas. Tech.ChEMBL_532745 (CHEMBL972319)
IC50 1±n/a nM
Citation Erchegyi, JGrace, CRSamant, MCescato, RPiccand, VRiek, RReubi, JCRivier, JE Ring size of somatostatin analogues (ODT-8) modulates receptor selectivity and binding affinity. J Med Chem51:2668-75 (2008) 
 
Somatostatin receptor type 4
Name:Somatostatin receptor type 4
Type:Enzyme
Mol. Mass.:42015.38
Organism:Homo sapiens (Human)
Description:P31391
Residue:388
BDBM50261389
NameBDBM50261389
Synonyms:(4R,7S,10S,13S,16R,19S,22S,25R)-25-Amino-13-(4-amino-butyl)-7,19,22-tribenzyl-10-((R)-1-hydroxy-ethyl)-16-(1H-indol-3-ylmethyl)-6,9,12,15,18,21,24-heptaoxo-1,2-dithia-5,8,11,14,17,20,23-heptaaza-cyclohexacosane-4-carboxylic acid | CHEMBL500326
TypeSmall organic molecule
Emp. Form.C54H66N10O10S2
Mol. Mass.1079.293
SMILESC[C@@H](O)[C@@H]1NC(=O)[C@H](CCCCN)NC(=O)[C@@H](Cc2c[nH]c3ccccc23)NC(=O)[C@H](Cc2ccccc2)NC(=O)[C@H](Cc2ccccc2)NC(=O)[C@H](N)CSSC[C@H](NC(=O)[C@H](Cc2ccccc2)NC1=O)C(O)=O