Reaction Details
TargetKappa-type opioid receptor
LigandBDBM50261178
Substrate/Competitorn/a
Meas. Tech.ChEMBL_533290 (CHEMBL973309)
EC50 15±n/a nM
Citation Wentland, MPSun, XCohen, DJBidlack, JM Redefining the structure-activity relationships of 2,6-methano-3-benzazocines. Part 6: Opioid receptor binding properties of cyclic variants of 8-carboxamidocyclazocine. Bioorg Med Chem16:5653-64 (2008) 
 
Kappa-type opioid receptor
Name:Kappa-type opioid receptor
Type:G Protein-Coupled Receptor (GPCR)
Mol. Mass.:42648.76
Organism:Homo sapiens (Human)
Description:P41145
Residue:380
BDBM50261178
NameBDBM50261178
Synonyms:CHEMBL522375 | cis-(+/-)-3-(Cyclopropylmethyl)-1,2,3,4,5,6-hexahydro-6,11-dimethyl-7-amino-2,6-methano-3-benzazocine-8-carboxamide
TypeSmall organic molecule
Emp. Form.C19H27N3O
Mol. Mass.313.4372
SMILESC[C@H]1C2Cc3ccc(C(N)=O)c(N)c3[C@@]1(C)CCN2CC1CC1